Target
Serine protease 1
Ligand
BDBM7460
Substrate
Meas. Tech.
Enzyme Assay
pH
8±n/a
IC50
10000±n/a nM
Comments
extracted
Citation
 Viskupicova, JDanihelova, MMajekova, MLiptaj, TSturdik, E Polyphenol fatty acid esters as serine protease inhibitors: a quantum-chemical QSAR analysis. J Enzyme Inhib Med Chem 27:800-9 (2012)  
Target
Name:
Serine protease 1
Synonyms:
Beta-Trypsin PRSS1 TRY1 TRYP1 Trypsin I
Type:
Enzyme
Mol. Mass.:
25790.52
Organism:
Bos taurus (bovine)
Description:
P00760
Residue:
246
  
Inhibitor
Name:
BDBM7460
Synonyms:
2-(3,4-dihydroxyphenyl)-3,5,7-trihydroxy-4H-chromen-4-one 2-(3,4-dihydroxyphenyl)-3,5,7-trihydroxy-chromone;hydrate Quercetin Quercetin (21) US11021454, Compound Quercetin med.21724, Compound 4
Type:
Small organic molecule
Emp. Form.:
C15H10O7
Mol. Mass.:
302.2357
SMILES:
Oc1cc(O)c2c(c1)oc(-c1ccc(O)c(O)c1)c(O)c2=O
: