Target
Carbonic anhydrase 2
Ligand
BDBM39340
Substrate
Meas. Tech.
CA Activity Assay
pH
7.4±n/a
Ki
348±n/a nM
Comments
extracted
Citation
 Ekinci, DKurbanoglu, NISalamci, ESentürk, MSupuran, CT Carbonic anhydrase inhibitors: inhibition of human and bovine isoenzymes by benzenesulphonamides, cyclitols and phenolic compounds. J Enzyme Inhib Med Chem 27:845-8 (2012)  
Target
Name:
Carbonic anhydrase 2
Synonyms:
CA-II CAC Carbonate dehydratase II Carbonic anhydrase 2 (CA-II) Carbonic anhydrase C Carbonic anhydrase II (CA-II) Carbonic anhydrase II (hCA II) | Carbonic anhydrase isoenzyme II (hCA II)
Type:
Enzyme
Mol. Mass.:
29250.71
Organism:
Homo sapiens (Human)
Description:
P00918
Residue:
260
  
Inhibitor
Name:
BDBM39340
Synonyms:
4-Amino-N-(pyrimidin-2-yl) benzenesulfonamide (Sulfadiazine) (14) SMR000058213 cid_5336
Type:
Small organic molecule
Emp. Form.:
C11H11N3O2S
Mol. Mass.:
249.289
SMILES:
Nc1ccc(cc1)S(=O)(=O)Nc1ccccn1
: