Target
Serine-protein kinase ATM
Ligand
BDBM245523
Substrate
Meas. Tech.
Cellular Assay
Temperature
310.15±n/a K
IC50
0.722±n/a nM
Comments
extracted
Citation
 Barlaam, BCPike, KG Imidazo[4,5-c]quinolin-2-one compounds and their use in treating Cancer US Patent  US9428503 Publication Date 8/30/2016 
Target
Name:
Serine-protein kinase ATM
Synonyms:
A-T mutated ATM_HUMAN | Ataxia telangiectasia mutated
Type:
Protein
Mol. Mass.:
350696.72
Organism:
Homo sapiens (Human)
Description:
Q13315
Residue:
3056
  
Inhibitor
Name:
BDBM245523
Synonyms:
US9428503, 51
Type:
Small organic molecule
Emp. Form.:
C25H28FN5O2
Mol. Mass.:
449.5205
SMILES:
CN(C)CCCOc1ccc(c(F)n1)-c1ccc2ncc3n(C)c(=O)n(C4CCC4)c3c2c1
: