Target
5'-AMP-activated protein kinase catalytic subunit alpha-2/subunit beta-1/subunit gamma-1
Ligand
BDBM260446
Substrate
Meas. Tech.
In Vitro AMPK Activation Assay
pH
7.3±n/a
Temperature
298.15±n/a K
EC50
11±n/a nM
Comments
extracted
Citation
 Apgar, JMBiftu, TChen, PFeng, DHicks, JDKekec, ALeavitt, KJLi, BSebhat, IQian, XWei, LWilkening, RRWu, Z Benzimidazole tetrahydropyran derivatives US Patent  US9527839 Publication Date 12/27/2016 
Target
Name:
5'-AMP-activated protein kinase catalytic subunit alpha-2/subunit beta-1/subunit gamma-1
Synonyms:
AMPK alpha2/beta1/gamma1 AMPK complex 7 (containing alpha-2, beta-1, gamma-1)
Type:
Mol. Mass.:
Description:
ASSAY_ID of ChEMBL is 1970361
Components:
This complex has 3 components.
Component 1
Name:
5'-AMP-activated protein kinase catalytic subunit alpha-2
Synonyms:
AAPK2_HUMAN AMP-activated protein kinase, alpha-2 subunit AMPK subunit alpha-2 AMPK2 Hydroxymethylglutaryl-CoA reductase kinase | PRKAA2
Type:
Enzyme
Mol. Mass.:
62331.02
Organism:
Homo sapiens (Human)
Description:
P54646
Residue:
552
  
Component 2
Name:
5'-AMP-activated protein kinase subunit gamma-1
Synonyms:
5'-AMP-activated protein kinase subunit gamma-1 AMP-activated protein kinase, gamma-1 subunit AMPK gamma-1 AMPK subunit gamma-1 PRKAG1
Type:
Mol. Mass.:
37581.44
Organism:
Homo sapiens (Human)
Description:
P54619
Residue:
331
  
Component 3
Name:
5'-AMP-activated protein kinase subunit beta-1
Synonyms:
5'-AMP-activated protein kinase subunit beta-1 AMP-activated protein kinase alpha-2/beta-1/gamma-3 AMPK subunit beta-1 PRKAB1
Type:
Mol. Mass.:
30380.94
Organism:
Homo sapiens (Human)
Description:
Q9Y478
Residue:
270
  
Inhibitor
Name:
BDBM260446
Synonyms:
US9527839, 44
Type:
Small organic molecule
Emp. Form.:
C29H28F2N2O6
Mol. Mass.:
538.5392
SMILES:
OC[C@H]1OC[C@@H](C[C@@H]1O)Oc1nc2c(F)c(c(F)cc2[nH]1)-c1ccc(cc1)-c1ccc(CCCC(O)=O)cc1
: