Target
Tyrosine-protein phosphatase non-receptor type 11
Ligand
BDBM408096
Substrate
Meas. Tech.
SHP2 Allosteric Inhibition Assay
IC50
4.00±n/a nM
Citation
 Chen, CHChen, ZDore, MFortanet, JGGiraldes, JWKarki, RKato, MLaMarche, MJPerez, LBSendzik, MSmith, TDToure, BWilliams, S N-azaspirocycloalkane substituted N-heteroaryl compounds and compositions for inhibiting the activity of SHP2 US Patent  US10336774 Publication Date 7/2/2019 
Target
Name:
Tyrosine-protein phosphatase non-receptor type 11
Synonyms:
3.1.3.48 PTP-1D PTP2C Protein Tyrosine Phosphatase PPN11/Shp2 Protein-Tyrosine Phosphatase SHP-2 Protein-tyrosine phosphatase 2C SH-PTP3 SHP2 Src homology phosphatase 2 (SHP-2) Tyrosine-protein phosphatase non-receptor type 11 (SHP-2) | Tyrosine-protein phosphatase non-receptor type 11 (SHP2)
Type:
Protein phosphatase
Mol. Mass.:
68443.59
Organism:
Homo sapiens (Human)
Description:
Q06124
Residue:
593
  
Inhibitor
Name:
BDBM408096
Synonyms:
US10336774, Example 90
Type:
Small organic molecule
Emp. Form.:
C18H23Cl2N7OS
Mol. Mass.:
456.393
SMILES:
N[C@@H]1C[C@@H](O)CC11CCN(CC1)c1cnc(Sc2cc(N)nc(Cl)c2Cl)c(N)n1
: