Target
Replicase polyprotein 1ab
Ligand
BDBM420298
Substrate
Meas. Tech.
FRET protease activity assay
Ki
4.0±0.37 nM
Citation
 Boras, BJones, RMAnson, BJArenson, DAschenbrenner, LBakowski, MABeutler, NBinder, JChen, EEng, HHammond, JHoffman, RKadar, EPKania, RKimoto, EKirkpatrick, MGLanyon, LLendy, EKLillis, JRLuthra, SAMa, CNoell, SObach, RSO Brien, MNO Connor, ROgilvie, KOwen, DPettersson, MReese, MRRogers, TRossulek, MISathish, JGSteppan, CTicehurst, MUpdyke, LWZhu, YWang, JChatterjee, AKMesecar, ADAnderson, ASAllerton, C Discovery of a Novel Inhibitor of Coronavirus 3CL Protease as a Clinical Candidate for the Potential Treatment of COVID-19. bioRxiv 0:0 (2020)  
Target
Name:
Replicase polyprotein 1ab
Synonyms:
ORF1ab polyprotein pp1ab | rep
Type:
Protein
Mol. Mass.:
744565.76
Organism:
IBV
Description:
P0C6Y2
Residue:
6629
  
Inhibitor
Name:
BDBM420298
Synonyms:
CVD-0006356 PF-0835231 US11753373, Compound A-5-d WO2021205298, Compound 1 | cmdc.202100576, 6b
Type:
Small organic molecule
Emp. Form.:
C24H32N4O6
Mol. Mass.:
472.5341
SMILES:
COc1cccc2[nH]c(cc12)C(=O)N[C@@H](CC(C)C)C(=O)N[C@@H](C[C@@H]1CCNC1=O)C(=O)CO
: