Target
Replicase polyprotein 1ab
Ligand
BDBM420993
Substrate
Meas. Tech.
IC50 Determination
IC50
6900±500 nM
Citation
 St. John, SEMesecar, AD Broad-spectrum non-covalent coronavirus protease inhibitors US Patent  US9975885 Publication Date 5/22/2018 
Target
Name:
Replicase polyprotein 1ab
Synonyms:
3C-like proteinase 3CLp Exoribonuclease Helicase NendoU Non-structural protein 10 Non-structural protein 2 Non-structural protein 4 Non-structural protein 7 Non-structural protein 9 PLP1/PLP2 Peptide HD2 Putative 2'-O-methyl transferase RNA-directed RNA polymerase Uridylate-specific endoribonuclease nsp10 nsp12 nsp14 nsp16 nsp3 nsp5 nsp7 nsp9 rep
Type:
PROTEIN
Mol. Mass.:
751194.38
Organism:
Feline coronavirus (strain FIPV WSU-79/1146) (FCoV)
Description:
ChEMBL_117869
Residue:
6709
  
Inhibitor
Name:
BDBM420993
Synonyms:
US9975885, Compound 47
Type:
Small organic molecule
Emp. Form.:
C26H31N5O2
Mol. Mass.:
445.5566
SMILES:
CC(C)(C)c1ccc(cc1)N(C(C(=O)NC1CCCC1)c1cccnc1)C(=O)c1c[nH]cn1
: