Target
ADP-ribosylhydrolase ARH3
Ligand
BDBM421622
Substrate
Meas. Tech.
ARH3 Assay
IC50
>150000±n/a nM
Citation
 McGonagle, AEJordan, AMWaszkowycz, BHutton, CPWaddell, IDHitchin, JRSmith, KMHamilton, NM PARG inhibitory compounds US Patent  US10508086 Publication Date 12/17/2019 
Target
Name:
ADP-ribosylhydrolase ARH3
Synonyms:
ADP-ribose glycohydrolase ARH3 ADPRHL2 ADPRS_HUMAN O-acetyl-ADP-ribose deacetylase ARH3 [Protein ADP-ribosylarginine] hydrolase-like protein 2 | [Protein ADP-ribosylserine] hydrolase
Type:
Enzyme Catalytic Domain
Mol. Mass.:
38934.22
Organism:
Homo sapiens (Human)
Description:
Q9NX46
Residue:
363
  
Inhibitor
Name:
BDBM421622
Synonyms:
3-[5-(Difluoromethyl)-1,3,4-oxadiazol-2-yl]-6-fluoro-1-(2-fluoroethyl)-N-[1-(fluoromethyl)cyclopropyl]-2-oxo-benzimidazole-5-sulfonamide US10995073, Example 212
Type:
Small organic molecule
Emp. Form.:
C16H14F5N5O4S
Mol. Mass.:
467.37
SMILES:
FCCn1c2cc(F)c(cc2n(-c2nnc(o2)C(F)F)c1=O)S(=O)(=O)NC1(CF)CC1
: