Target
Replicase polyprotein 1ab
Ligand
BDBM423470
Substrate
Meas. Tech.
Coronavirus 3C Protease FRET Assay
IC50
>100000±n/a nM
Citation
 Hoffman, RLKania, RSNieman, JAPlanken, SPIii, GJ Anticoronviral compounds and compositions, their pharmaceutical uses and materials for their synthesis WIPO 0:0 (2005) Target
Name:
Replicase polyprotein 1ab
Synonyms:
3C-like proteinase 3C-like proteinase (SARS-CoV 3Cpro) 3CLp GFL Guanine-N7 methyltransferase Helicase Leader protein Non-structural protein 10 Non-structural protein 3 Non-structural protein 6 Non-structural protein 8 ORF1ab polyprotein PL2-PRO Pol R1AB_SARS RdRp SARS coronavirus main proteinase nsp1 nsp12 nsp14 nsp16 nsp3 nsp5 nsp7 nsp9 pp1ab | rep
Type:
Protein
Mol. Mass.:
790250.81
Organism:
Human SARS coronavirus (SARS-CoV) (Severe acute respiratory syndrome coronavirus)
Description:
P0C6X7
Residue:
7073
  
Inhibitor
Name:
BDBM423470
Synonyms:
WO2006061714, P39.5 | WO2006061714-ID-15
Type:
Small Organic Molecule
Emp. Form.:
C25H37N5O6
Mol. Mass.:
503.5912
SMILES:
CON(C)C(=O)[C@H](CCC(=O)N(C)C)NC(=O)[C@H](CC(C)C)NC(=O)c1cc2c(OC)cccc2[nH]1
: