Target
Angiotensin-converting enzyme 2
Ligand
BDBM50233798
Substrate
Meas. Tech.
No assay is provided
IC50
57000±n/a nM
Citation
 Pillaiyar, TWendt, LLManickam, MEaswaran, M The recent outbreaks of human coronaviruses: A medicinal chemistry perspective. Med Res Rev 0:0 (2020)  
Target
Name:
Angiotensin-converting enzyme 2
Synonyms:
ACE-related carboxypeptidase ACE2_HUMAN Angiotensin-converting enzyme homolog Metalloprotease MPROT15
Type:
Enzyme
Mol. Mass.:
92448.86
Organism:
Homo sapiens (Human)
Description:
Residue:
805
  
Inhibitor
Name:
BDBM50233798
Synonyms:
CHEMBL398940 med.21724, Compound 7
Type:
Small organic molecule
Emp. Form.:
C6H15N3
Mol. Mass.:
129.2034
SMILES:
NCCNCCN1CC1
: