Target
Angiotensin-converting enzyme 2
Ligand
BDBM429241
Substrate
Meas. Tech.
No assay is provided
IC50
0.44±n/a nM
Citation
 Pillaiyar, TWendt, LLManickam, MEaswaran, M The recent outbreaks of human coronaviruses: A medicinal chemistry perspective. Med Res Rev 0:0 (2020)  
Target
Name:
Angiotensin-converting enzyme 2
Synonyms:
ACE-related carboxypeptidase ACE2_HUMAN Angiotensin-converting enzyme homolog Metalloprotease MPROT15
Type:
Enzyme
Mol. Mass.:
92448.86
Organism:
Homo sapiens (Human)
Description:
Residue:
805
  
Inhibitor
Name:
BDBM429241
Synonyms:
med.21724, Compound 13
Type:
Small Organic Molecule
Emp. Form.:
C19H23Cl2N3O4
Mol. Mass.:
428.31
SMILES:
CC(C)CC(NC(Cc1cncn1Cc1cc(Cl)cc(Cl)c1)C(O)=O)C(O)=O
: