Target
Procathepsin L
Ligand
BDBM429284
Substrate
Meas. Tech.
No assay is provided
IC50
56±n/a nM
Citation
 Pillaiyar, TWendt, LLManickam, MEaswaran, M The recent outbreaks of human coronaviruses: A medicinal chemistry perspective. Med Res Rev 0:0 (2020)  
Target
Name:
Procathepsin L
Synonyms:
CATL1_HUMAN CTSL CTSL1 Cathepsin L Cathepsin L1 heavy chain MEP cathepsin L preproprotein
Type:
Enzyme
Mol. Mass.:
37557.19
Organism:
Homo sapiens (Human)
Description:
Purchased from Calbiochem (San Diego, CA).
Residue:
333
  
Inhibitor
Name:
BDBM429284
Synonyms:
med.21724, Compound 22
Type:
Small Organic Molecule
Emp. Form.:
C28H33N5O6
Mol. Mass.:
535.5915
SMILES:
CC(C)(C)OC(=O)NC(Cc1c[nH]c2ccccc12)C(=O)NNC(=O)OCC(=O)N1CCCc2ccccc12
: