Target
Replicase polyprotein 1ab
Ligand
BDBM11234
Substrate
Meas. Tech.
No assay is provided
IC50
60±n/a nM
Citation
 Pillaiyar, TWendt, LLManickam, MEaswaran, M The recent outbreaks of human coronaviruses: A medicinal chemistry perspective. Med Res Rev 0:0 (2020)  
Target
Name:
Replicase polyprotein 1ab
Synonyms:
3C-like proteinase 3C-like proteinase (SARS-CoV 3Cpro) 3CLp GFL Guanine-N7 methyltransferase Helicase Leader protein Non-structural protein 10 Non-structural protein 3 Non-structural protein 6 Non-structural protein 8 ORF1ab polyprotein PL2-PRO Pol R1AB_SARS RdRp SARS coronavirus main proteinase nsp1 nsp12 nsp14 nsp16 nsp3 nsp5 nsp7 nsp9 pp1ab | rep
Type:
Protein
Mol. Mass.:
790250.81
Organism:
Human SARS coronavirus (SARS-CoV) (Severe acute respiratory syndrome coronavirus)
Description:
P0C6X7
Residue:
7073
  
Inhibitor
Name:
BDBM11234
Synonyms:
(2S)-N-(2-chloro-4-nitrophenyl)-2-{[4-(dimethylamino)phenyl]formamido}-3-phenylpropanamide N-(2-chloro-4-nitrophenyl)-N-[4-(dimethylamino)benzoyl]-L-phenylalaninamide med.21724, Compound 77
Type:
Small organic molecule
Emp. Form.:
C24H23ClN4O4
Mol. Mass.:
466.917
SMILES:
CN(C)c1ccc(cc1)C(=O)N[C@@H](Cc1ccccc1)C(=O)Nc1ccc(cc1Cl)[N+]([O-])=O
: