Target
Replicase polyprotein 1a
Ligand
BDBM31523
Substrate
Meas. Tech.
No assay is provided
IC50
560±n/a nM
Citation
 Pillaiyar, TWendt, LLManickam, MEaswaran, M The recent outbreaks of human coronaviruses: A medicinal chemistry perspective. Med Res Rev 0:0 (2020)  
Target
Name:
Replicase polyprotein 1a
Synonyms:
3C-like proteinase 3CLp Growth factor-like peptide Non-structural protein 1 Non-structural protein 11 Non-structural protein 3 Non-structural protein 6 Non-structural protein 8 ORF1a polyprotein PL2-PRO Papain-like proteinase Replicase polyprotein 1a SARS coronavirus 3C-like proteinase nsp1 nsp11 nsp3 nsp5 nsp7 nsp9 pp1a
Type:
Enzyme
Mol. Mass.:
486353.36
Organism:
Human SARS coronavirus (SARS-CoV)
Description:
P0C6U8
Residue:
4382
  
Inhibitor
Name:
BDBM31523
Synonyms:
Compound 6 med.21724, Compound 162
Type:
Small organic molecule
Emp. Form.:
C22H22N2O2
Mol. Mass.:
346.4223
SMILES:
C[C@@H](NC(=O)c1cc(NC(C)=O)ccc1C)c1cccc2ccccc12
: