Target
Replicase polyprotein 1ab
Ligand
BDBM50017696
Substrate
Meas. Tech.
No assay is provided
EC50
7540±n/a nM
Citation
 Pillaiyar, TWendt, LLManickam, MEaswaran, M The recent outbreaks of human coronaviruses: A medicinal chemistry perspective. Med Res Rev 0:0 (2020)  
Target
Name:
Replicase polyprotein 1ab
Synonyms:
3C-like proteinase 3C-like proteinase (SARS-CoV 3Cpro) 3CLp GFL Guanine-N7 methyltransferase Helicase Leader protein Non-structural protein 10 Non-structural protein 3 Non-structural protein 6 Non-structural protein 8 ORF1ab polyprotein PL2-PRO Pol R1AB_SARS RdRp SARS coronavirus main proteinase nsp1 nsp12 nsp14 nsp16 nsp3 nsp5 nsp7 nsp9 pp1ab | rep
Type:
Protein
Mol. Mass.:
790250.81
Organism:
Human SARS coronavirus (SARS-CoV) (Severe acute respiratory syndrome coronavirus)
Description:
P0C6X7
Residue:
7073
  
Inhibitor
Name:
BDBM50017696
Synonyms:
(2-dimethylamino-2-methyl)ethyl-N-dibenzoparathiazine 10-[2-(dimethylamino)propyl]phenothiazine N,N,alpha-trimethyl-10H-phenothiazine-10-ethanamine PROMETHAZINE proazamine
Type:
Small organic molecule
Emp. Form.:
C17H20N2S
Mol. Mass.:
284.419
SMILES:
CC(CN1c2ccccc2Sc2ccccc12)N(C)C
: