Target
5-hydroxytryptamine receptor 1A
Ligand
BDBM433509
Substrate
Meas. Tech.
Receptor Binding Assay
Ki
0.080±n/a nM
Citation
 Sniecikowska, JBucki, ANewman-Tancredi, AVarney, MA Compounds for treating disorders sensitive to serotoninergic regulation controlled by the 5-HT1A receptors US Patent  US10562853 Publication Date 2/18/2020 
Target
Name:
5-hydroxytryptamine receptor 1A
Synonyms:
5-HT-1A 5-hydroxytryptamine receptor 1A (5-HT-1A) ADRB2RL1 Dopamine D2 receptor and serotonin 1a receptor HTR1A | Serotonin receptor 1A
Type:
Mol. Mass.:
46122.49
Organism:
Homo sapiens (Human)
Description:
Residue:
422
  
Inhibitor
Name:
BDBM433509
Synonyms:
US10562853, Compound 27
Type:
Small organic molecule
Emp. Form.:
C22H27ClF2N4O2
Mol. Mass.:
452.925
SMILES:
CN(C)c1cccc(OCCNCC2(F)CCN(CC2)C(=O)c2ccc(F)c(Cl)c2)n1
: