Target
Tyrosyl-DNA phosphodiesterase 2
Ligand
BDBM437686
Substrate
Meas. Tech.
Biochemical Potency
IC50
5.01±0.69 nM
Citation
 Wang, ZKankanala, JPommier, Y Compounds for cancer chemotherapeutic sensitization US Patent  US10617706 Publication Date 4/14/2020 
Target
Name:
Tyrosyl-DNA phosphodiesterase 2
Synonyms:
EAP2 ETS1-associated protein 2 TDP2 TTRAP Tyr-DNA phosphodiesterase 2 Tyrosyl-DNA phosphodiesterase 2 (hTDP2) VPg unlinkase | hTDP2
Type:
Enzyme Catalytic Domain
Mol. Mass.:
40916.54
Organism:
Homo sapiens (Human)
Description:
gi_23510348
Residue:
362
  
Inhibitor
Name:
BDBM437686
Synonyms:
US10617706, Example 120
Type:
Small organic molecule
Emp. Form.:
C24H17BN4O5
Mol. Mass.:
452.227
SMILES:
OB(O)c1cccc(Oc2ccc(cc2)N2C3NC(=O)NC(=O)C3=Cc3ccc(cc23)C#N)c1
: