Target
cGMP-dependent 3',5'-cyclic phosphodiesterase
Ligand
BDBM442791
Substrate
Meas. Tech.
Inhibitory Activity Assay (Lab B)
Ki
174±n/a nM
Citation
 Morriello, GJChang, LForster, ABerger, RNanda, KKShipe, WD Substituted pyrazolo/imidazolo bicyclic compounds as PDE2 inhibitors US Patent  US10647727 Publication Date 5/12/2020 
Target
Name:
cGMP-dependent 3',5'-cyclic phosphodiesterase
Synonyms:
CGS-PDE Homo sapiens phosphodiesterase 2A (PDE2A) PDE2A cGSPDE
Type:
Enzyme Catalytic Domain
Mol. Mass.:
105691.58
Organism:
Homo sapiens (Human)
Description:
O00408
Residue:
941
  
Inhibitor
Name:
BDBM442791
Synonyms:
N-{(1R)-1-[3-Fluoro-4-(trifluoromethyl)phenyl]-2,2-dimethylpropyl}-5-methylpyrazolo[1,5-a]pyrimidin-7-amine | US10647727, Example 48
Type:
Small organic molecule
Emp. Form.:
C19H20F4N4
Mol. Mass.:
380.3825
SMILES:
Cc1cc(N[C@@H](c2ccc(c(F)c2)C(F)(F)F)C(C)(C)C)n2nccc2n1
: