Target
Replicase polyprotein 1ab
Ligand
BDBM442806
Substrate
Meas. Tech.
Hit profiling assay with DTT
IC50
90±n/a nM
Citation
 Kuzikov, MCostanzi, EReinshagen, JEsposito, FVangeel, LWolf, MEllinger, BClaussen, CGeisslinger, GCorona, AIaconis, DTalarico, CManelfi, CCannalire, RRossetti, GGossen, JAlbani, SMusiani, FHerzog, KYe, YGiabbai, BDemitri, NJochmans, DDe Jonghe, SRymenants, JSumma, VTramontano, EBeccari, ARLeyssen, PStorici, PNeyts, JGribbon, PZaliani, A Identification of inhibitors of SARS-CoV-2 3CL-Pro enzymatic activity using a small molecule in-vitro repurposing screen bioRxiv 2020:0 (2020)    Article 
Target
Name:
Replicase polyprotein 1ab
Synonyms:
ORF1ab polyprotein pp1ab | rep
Type:
Protein
Mol. Mass.:
794070.71
Organism:
2019-nCoV
Description:
P0DTD1
Residue:
7096
  
Inhibitor
Name:
BDBM442806
Synonyms:
Bonaphthone
Type:
Small organic molecule
Emp. Form.:
C10H5BrO2
Mol. Mass.:
237.05
SMILES:
Brc1ccc2C(=O)C(=O)C=Cc2c1
: