Target
ALK tyrosine kinase receptor [L1196M]
Ligand
BDBM448458
Substrate
Meas. Tech.
Inhibition Assay
IC50
<1±n/a nM
Citation
 Wang, XXu, YSheng, XZhang, XXia, HYang, ZYue, YHuang, LXiao, Q Pyrimidine derivative and use thereof US Patent  US10695347 Publication Date 6/30/2020 
Target
Name:
ALK tyrosine kinase receptor [L1196M]
Synonyms:
ALK ALK tyrosine kinase receptor (ALK) (L1196M) ALK tyrosine kinase receptor (L1196M) Anaplastic lymphoma kinase L1196M (ALK L1196M) | Tyrosine-protein kinase receptor [L1196M]
Type:
Mol. Mass.:
176471.13
Organism:
Homo sapiens (Human)
Description:
Q9UM73[L1196M]
Residue:
1620
  
Inhibitor
Name:
BDBM448458
Synonyms:
US10695347, Compound I-86
Type:
Small organic molecule
Emp. Form.:
C26H32ClN5O3S2
Mol. Mass.:
562.147
SMILES:
COc1cc(ccc1Nc1ncc(Cl)c(Nc2ccsc2S(=O)(=O)C(C)C)n1)C1=CCN(CC1)C(C)C
: