Target
Protein S100-A9
Ligand
BDBM299071
Substrate
Meas. Tech.
S100A9-RAGE inhibition assay
IC50
2100±n/a nM
Citation
 Fritzson, ILiberg, DEast, SMackinnon, CPrevost, N N-(heteroaryl)-sulfonamide derivatives useful as S100-inhibitors US Patent  US10125125 Publication Date 11/13/2018 
Target
Name:
Protein S100-A9
Synonyms:
CAGB Calgranulin-B Leukocyte L1 complex heavy chain MRP14 S100 calcium-binding protein A9 S10A9_HUMAN | p14
Type:
Enzyme Catalytic Domain
Mol. Mass.:
13239.84
Organism:
Homo sapiens (Human)
Description:
Residue:
114
  
Inhibitor
Name:
BDBM299071
Synonyms:
3,5-dichloro-N-(5-chloro-4-hydroxypyridin-3-yl)benzene-1-sulfonamide | US10125125, Example 89
Type:
Small organic molecule
Emp. Form.:
C11H7Cl3N2O3S
Mol. Mass.:
353.609
SMILES:
Oc1c(Cl)cncc1NS(=O)(=O)c1cc(Cl)cc(Cl)c1
: