Target
Protein S100-A9
Ligand
BDBM299106
Substrate
Meas. Tech.
S100A9-RAGE inhibition assay
IC50
<1000±n/a nM
Citation
 Fritzson, ILiberg, DEast, SMackinnon, CPrevost, N N-(heteroaryl)-sulfonamide derivatives useful as S100-inhibitors US Patent  US10125125 Publication Date 11/13/2018 
Target
Name:
Protein S100-A9
Synonyms:
CAGB Calgranulin-B Leukocyte L1 complex heavy chain MRP14 S100 calcium-binding protein A9 S10A9_HUMAN | p14
Type:
Enzyme Catalytic Domain
Mol. Mass.:
13239.84
Organism:
Homo sapiens (Human)
Description:
Residue:
114
  
Inhibitor
Name:
BDBM299106
Synonyms:
N-(6-chloro-2-hydroxypyridin-3-yl)-1-(5-chloro-6-methoxypyridin-3-yl)methane-sulfonamide | US10125125, Example 182
Type:
Small organic molecule
Emp. Form.:
C12H11Cl2N3O4S
Mol. Mass.:
364.204
SMILES:
COc1ncc(CS(=O)(=O)Nc2ccc(Cl)nc2O)cc1Cl
: