Target
Protein arginine N-methyltransferase 5
Ligand
BDBM451383
Substrate
Meas. Tech.
Biochemical Assay
IC50
1.000±n/a nM
Citation
 Tatlock, JHMcAlpine, IJTran-Dube, MBRui, EYWythes, MJKumpf, RAMcTigue, MAPatman, R Substituted carbonucleoside derivatives useful as anticancer agents US Patent  US10709709 Publication Date 7/14/2020 
Target
Name:
Protein arginine N-methyltransferase 5
Synonyms:
72 kDa ICln-binding protein HRMT1L5 IBP72 Jak-binding protein 1 PRMT5/MEP50 complex Protein arginine methyltransferase 5 (PRMT5) SKB1 homolog Shk1 kinase-binding protein 1 homolog
Type:
Enzyme
Mol. Mass.:
72679.99
Organism:
Homo sapiens (Human)
Description:
O14744
Residue:
637
  
Inhibitor
Name:
BDBM451383
Synonyms:
US10709709, Example 213 | US10709709, Example 214
Type:
Small organic molecule
Emp. Form.:
C22H25FN4O3
Mol. Mass.:
412.4573
SMILES:
CC1NCCc2c(F)ccc(O[C@H]3C[C@H]([C@H](O)[C@@H]3O)n3ccc4c(C)ncnc34)c12
: