Target
ATP-sensitive inward rectifier potassium channel 1
Ligand
BDBM456268
Substrate
Meas. Tech.
Electrophysiology Assay
IC50
2.10±n/a nM
Citation
 Gunaga, PBhide, RSBora, ROPanda, MYadav, NDPriestley, ESRichter, J Substituted bicycle heterocyclic derivatives useful as ROMK channel inhibitors US Patent  US10723723 Publication Date 7/28/2020 
Target
Name:
ATP-sensitive inward rectifier potassium channel 1
Synonyms:
ATP-regulated potassium channel ROM-K ATP-sensitive inward rectifier potassium channel 1 KCNJ1 Potassium channel (ATP modulatory) ROMK1 The Renal Outer Medullary Potassium (ROMK)
Type:
Enzyme Catalytic Domain
Mol. Mass.:
44809.08
Organism:
Homo sapiens (Human)
Description:
gi_223460826
Residue:
391
  
Inhibitor
Name:
BDBM456268
Synonyms:
(R)-1-(5-(((2-hydroxy-2- (4-methyl-1-oxo-1,3- dihydroisobenzofuran-5- yl)ethyl)amino)methyl) pyridin-2-yl)-3-methyl-1H- pyrazole-4-carbonitrile | US10723723, Example 178
Type:
Small organic molecule
Emp. Form.:
C22H21N5O3
Mol. Mass.:
403.4338
SMILES:
Cc1nn(cc1C#N)-c1ccc(CNC[C@H](O)c2ccc3C(=O)OCc3c2C)cn1
: