Target
Lysine-specific histone demethylase 1A
Ligand
BDBM456493
Substrate
Meas. Tech.
Inhibitory Activity Assay
IC50
0.120±n/a nM
Citation
 Yamashita, SOgawa, TKomatani, H Biphenyl compound or salt thereof US Patent  US10723742 Publication Date 7/28/2020 
Target
Name:
Lysine-specific histone demethylase 1A
Synonyms:
AOF2 Flavin-containing amine oxidase domain-containing protein 2 KDM1A KIAA0601 Lysine-specific demethylase 1 (LSD1) Lysine-specific histone demethylase 1 (LSD1)
Type:
Enzyme
Mol. Mass.:
92901.01
Organism:
Homo sapiens (Human)
Description:
O60341
Residue:
852
  
Inhibitor
Name:
BDBM456493
Synonyms:
US10723742, Example 220 | US11510915, Example 220
Type:
Small organic molecule
Emp. Form.:
C33H33ClF2N6O2
Mol. Mass.:
619.104
SMILES:
CCC(O)(CC)Cn1nnc2cc(c(F)c(Cl)c12)-c1ccc(cc1-c1ccc(C#N)c(F)c1)C(=O)N1C2CCC1CC(N)C2
: