Target
Lysine-specific histone demethylase 1A
Ligand
BDBM456491
Substrate
Meas. Tech.
Inhibitory Activity Assay
IC50
0.200±n/a nM
Citation
 Yamashita, SOgawa, TKomatani, H Biphenyl compound or salt thereof US Patent  US10723742 Publication Date 7/28/2020 
Target
Name:
Lysine-specific histone demethylase 1A
Synonyms:
AOF2 Flavin-containing amine oxidase domain-containing protein 2 KDM1A KIAA0601 Lysine-specific demethylase 1 (LSD1) Lysine-specific histone demethylase 1 (LSD1)
Type:
Enzyme
Mol. Mass.:
92901.01
Organism:
Homo sapiens (Human)
Description:
O60341
Residue:
852
  
Inhibitor
Name:
BDBM456491
Synonyms:
US10723742, Example 218 US11510915, Example 221
Type:
Small organic molecule
Emp. Form.:
C32H31ClF2N6O2
Mol. Mass.:
605.077
SMILES:
CCC(O)(CC)Cn1nnc2cc(c(F)c(Cl)c12)-c1ccc(cc1-c1ccc(C#N)c(F)c1)C(=O)N1[C@@H]2CC[C@H]1[C@@H](N)C2
: