Target
Retinoic acid receptor alpha
Ligand
BDBM50526312
Substrate
Meas. Tech.
Transactivation assays
EC50
16.0±n/a nM
Citation
 Borthwick, ADMills, MTBrown, JTCorcoran, JPDe Castro Vasconcelos Goncalves, MBKalindjian, SB Bicycloheteroaryl-heteroaryl-benzoic acid compounds as retinoic acid receptor beta (RARβ) agonists US Patent  US10752616 Publication Date 8/25/2020 
Target
Name:
Retinoic acid receptor alpha
Synonyms:
NR1B1 RAR-alpha RARA_HUMAN Retinoic acid receptor alpha/Retinoid X receptor alpha Retinoid receptor
Type:
PROTEIN
Mol. Mass.:
50778.87
Organism:
Homo sapiens (Human)
Description:
ChEMBL_1466191
Residue:
462
  
Inhibitor
Name:
BDBM50526312
Synonyms:
CHEMBL4449668 | US10752616, Code No. BHBA-007
Type:
Small organic molecule
Emp. Form.:
C19H13FN2O4
Mol. Mass.:
352.3159
SMILES:
Cc1ccc(C)c2oc(cc12)-c1nc(no1)-c1ccc(C(O)=O)c(F)c1
: