Target
Fibroblast growth factor receptor 2 [403-822]
Ligand
BDBM350045
Substrate
IC50
1.40±n/a nM
Citation
 Andrews, SWBlake, JFCook, AGunawardana, IWHunt, KWMetcalf, ATMoreno, DRen, LTang, TP 2-aryl- and 2-heteroaryl-substituted 2-pyridazin-3(2H)-one compounds as inhibitors of FGFR tyrosine kinases US Patent  US10766881 Publication Date 9/8/2020 
Target
Name:
Fibroblast growth factor receptor 2 [403-822]
Synonyms:
BEK FGFR2_HUMAN KGFR | KSAM
Type:
Enzyme Catalytic Domain
Mol. Mass.:
47577.40
Organism:
Homo sapiens (Human)
Description:
aa 403-822
Residue:
420
  
Inhibitor
Name:
BDBM350045
Synonyms:
US10208024, Example 44 | US10766881, Example 44
Type:
Small organic molecule
Emp. Form.:
C22H23N7O3
Mol. Mass.:
433.4631
SMILES:
CCc1cc(nn(-c2cc(OC)cc(OC)c2)c1=O)-c1nc(cnc1N)-c1cnn(C)c1
: