Target
SUMO-activating enzyme subunit 1
Ligand
BDBM463060
Substrate
Meas. Tech.
Enzyme Assay
IC50
<10±n/a nM
Citation
 Duffey, MOEngland, DFreeze, BSHu, ZLangston, SMcIntyre, CMizutani, HOno, KXu, H Heteroaryl compounds useful as inhibitors of SUMO activating enzyme US Patent  US10780090 Publication Date 9/22/2020 
Target
Name:
SUMO-activating enzyme subunit 1
Synonyms:
AOS1 SAE1_HUMAN SUMO-activating enzyme subunit 1 (SAE1) UBLE1A
Type:
Enzyme Catalytic Domain
Mol. Mass.:
38440.84
Organism:
Homo sapiens (Human)
Description:
gi_17390638
Residue:
346
  
Inhibitor
Name:
BDBM463060
Synonyms:
US10780090, Compound I-305 US10780090, Compound I-305b | [(1R,2S,4R)-2-hydroxy-4-{[5-({5-methyl-4-[(4S)-2-methyl-6,7-dihydro-4H-pyrano[4,3- d][1,3]thiazol-4-yl]-2-thienyl}carbonyl)pyrimidin-4-yl]amino}cyclopentyl]methyl sulfamate
Type:
Small organic molecule
Emp. Form.:
C23H27N5O6S3
Mol. Mass.:
565.685
SMILES:
Cc1nc2CCO[C@@H](c3cc(sc3C)C(=O)c3cncnc3N[C@H]3C[C@H](O)[C@@H](COS(N)(=O)=O)C3)c2s1
: