Target
Guanylate cyclase soluble subunit alpha-1
Ligand
BDBM463293
Substrate
Meas. Tech.
Binding Assay
Ki
1.14±n/a nM
Citation
 Whitehead, AOrnoski, ORaghavan, SBerger, RGarfunkle, JYang, ZJi, GJiang, FFu, J Fused pyrazine derivatives useful as soluble guanylate cyclase stimulators US Patent  US10780092 Publication Date 9/22/2020 
Target
Name:
Guanylate cyclase soluble subunit alpha-1
Synonyms:
GCS-alpha-1 GCYA1_HUMAN GUCSA3 GUCY1A3 Guanylate cyclase soluble subunit alpha-3 Solube guanylate cyclase alpha-1 (sGCalpha) | soluble guanylate cyclase alpha-1 (sGC)
Type:
Enzyme
Mol. Mass.:
77457.21
Organism:
Homo sapiens (Human)
Description:
Q02108
Residue:
690
  
Inhibitor
Name:
BDBM463293
Synonyms:
4-(4-amino-2-{8- (cyclohexylmethyl)- imidazo[1,2-a]pyrazin- 6-yl}-5-methyl-6-oxo- 6,7-dihydro-5H-pyrrolo- [2,3-d]pyrimidin-5-yl)- 2-chloro-6-hydroxy- benzonitrile | US10780092, Example 142-A
Type:
Small organic molecule
Emp. Form.:
C27H25ClN8O2
Mol. Mass.:
528.993
SMILES:
CC1(C(=O)Nc2nc(nc(N)c12)-c1cn2ccnc2c(CC2CCCCC2)n1)c1cc(O)c(C#N)c(Cl)c1
: