Target
Prokineticin receptor 1
Ligand
BDBM463304
Substrate
Meas. Tech.
Aequorin-Based Luminescent Assay
Ki
2.50±n/a nM
Citation
 Zhou, Q Compositions and methods for treating disorders of circadian and diurnal rhythms using prokineticin 2 agonists and antagonists US Patent  US10780095 Publication Date 9/22/2020 
Target
Name:
Prokineticin receptor 1
Synonyms:
G-protein coupled receptor 73 GPR73 PK-R1 PKR1_HUMAN | PROKR1
Type:
enzyme
Mol. Mass.:
44779.92
Organism:
Homo sapiens (Human)
Description:
Q8TCW9
Residue:
393
  
Inhibitor
Name:
BDBM463304
Synonyms:
(-)-(2R)-1-(3-Methoxybenzyl)- N-(9-chloro-3,4-dihydro-2H- 1,5-benzodioxepin-7- ylmethyl)-N- isobutylmorpholine-2- carboxamide | US10780095, Structure TABLE 1.2
Type:
Small organic molecule
Emp. Form.:
C27H35ClN2O5
Mol. Mass.:
503.03
SMILES:
COc1cccc(CN2CCOC(C2)C(=O)N(CC(C)C)Cc2cc(Cl)c3OCCCOc3c2)c1
: