Target
Free fatty acid receptor 2
Ligand
BDBM404098
Substrate
Meas. Tech.
GTPγS Assay
EC50
600±n/a nM
Citation
 Hoveyda, HRSchils, DZoute, LParcq, J Substituted pyrrolidines as G-protein coupled receptor 43 agonists US Patent  US10781171 Publication Date 9/22/2020 
Target
Name:
Free fatty acid receptor 2
Synonyms:
FFA2 FFAR2_HUMAN GPCR43 | GPR43
Type:
PROTEIN
Mol. Mass.:
37156.44
Organism:
Homo sapiens (Human)
Description:
ChEMBL_1508993
Residue:
330
  
Inhibitor
Name:
BDBM404098
Synonyms:
(2S,5R)-5-isobutyl-1-(2'-methoxy-[1,1'-biphenyl]-4-carbonyl)pyrrolidine-2-carboxylic acid US10781171, Compound 294 | US11072582, Compound 294
Type:
Small organic molecule
Emp. Form.:
C23H27NO4
Mol. Mass.:
381.4648
SMILES:
COc1ccccc1-c1ccc(cc1)C(=O)N1[C@@H](CC(C)C)CC[C@H]1C(O)=O
: