Target
Plasma kallikrein
Ligand
BDBM463352
Substrate
Meas. Tech.
Inhibitory Activity Assay
IC50
114±n/a nM
Citation
 Evans, DMDavie, RLEdwards, HJHodgson, ST N-((het) arylmethyl)-heteroaryl-carboxamides compounds as plasma kallikrein inhibitors US Patent  US10781181 Publication Date 9/22/2020 
Target
Name:
Plasma kallikrein
Synonyms:
Fletcher factor KLKB1 Kallikrein Plasma kallikrein heavy chain Plasma prekallikrein
Type:
Protein
Mol. Mass.:
71391.16
Organism:
Homo sapiens (Human)
Description:
P03952
Residue:
638
  
Inhibitor
Name:
BDBM463352
Synonyms:
3-amino-N-[2-(3-chloro-5-methylphenoxy)ethyl]-1-({4-[(2-oxopyridin-1- | US10781181, Example 33
Type:
Small organic molecule
Emp. Form.:
C26H26ClN5O3
Mol. Mass.:
491.969
SMILES:
Cc1cc(Cl)cc(OCCNC(=O)c2cn(Cc3ccc(Cn4ccccc4=O)cc3)nc2N)c1
: