Target
Plasma kallikrein
Ligand
BDBM463425
Substrate
Meas. Tech.
Inhibitory Activity Assay
IC50
72.1±n/a nM
Citation
 Evans, DMDavie, RLEdwards, HJHodgson, ST N-((het) arylmethyl)-heteroaryl-carboxamides compounds as plasma kallikrein inhibitors US Patent  US10781181 Publication Date 9/22/2020 
Target
Name:
Plasma kallikrein
Synonyms:
Fletcher factor KLKB1 Kallikrein Plasma kallikrein heavy chain Plasma prekallikrein
Type:
Protein
Mol. Mass.:
71391.16
Organism:
Homo sapiens (Human)
Description:
P03952
Residue:
638
  
Inhibitor
Name:
BDBM463425
Synonyms:
3-amino-N-[2-(3-chlorophenoxy)ethyl]-1-({5-[(2-oxopyridin-1-yl)methyl]pyridin-2- | US10781181, Example 102
Type:
Small organic molecule
Emp. Form.:
C24H23ClN6O3
Mol. Mass.:
478.931
SMILES:
Nc1nn(Cc2ccc(Cn3ccccc3=O)cn2)cc1C(=O)NCCOc1cccc(Cl)c1
: