Target
Plasma kallikrein
Ligand
BDBM392631
Substrate
Meas. Tech.
In Vitro Enzyme Inhibition
IC50
>10000±n/a nM
Citation
 McDonald, AQian, S Therapeutic inhibitory compounds US Patent  US10781200 Publication Date 9/22/2020 
Target
Name:
Plasma kallikrein
Synonyms:
Fletcher factor KLKB1 Kallikrein Plasma kallikrein heavy chain Plasma prekallikrein
Type:
Protein
Mol. Mass.:
71391.16
Organism:
Homo sapiens (Human)
Description:
P03952
Residue:
638
  
Inhibitor
Name:
BDBM392631
Synonyms:
N-((6-amino-2,4-dimethylpyridin-3- yl)methyl)-1-((3-chloroquinolin-6- yl)methyl)-4-oxo-4,5-dihydro-1H- pyrrolo[3,2-c]pyridine-3-carboxamide US10781200, Example 118
Type:
Small organic molecule
Emp. Form.:
C26H23ClN6O2
Mol. Mass.:
486.953
SMILES:
Cc1cc(N)nc(C)c1CNC(=O)c1cn(Cc2ccc3ncc(Cl)cc3c2)c2cc[nH]c(=O)c12
: