Target
Plasma kallikrein
Ligand
BDBM392654
Substrate
Meas. Tech.
In Vitro Enzyme Inhibition
IC50
>10000±n/a nM
Citation
 McDonald, AQian, S Therapeutic inhibitory compounds US Patent  US10781200 Publication Date 9/22/2020 
Target
Name:
Plasma kallikrein
Synonyms:
Fletcher factor KLKB1 Kallikrein Plasma kallikrein heavy chain Plasma prekallikrein
Type:
Protein
Mol. Mass.:
71391.16
Organism:
Homo sapiens (Human)
Description:
P03952
Residue:
638
  
Inhibitor
Name:
BDBM392654
Synonyms:
N-((6-amino-2,4-dimethylpyridin-3- yl)methyl)-1-((3-chloroquinolin-6- yl)methyl)-4-(trifluoromethyl)-1H- 1,2,3-triazole-5-carboxamide US10781200, Example 141
Type:
Small organic molecule
Emp. Form.:
C22H19ClF3N7O
Mol. Mass.:
489.881
SMILES:
Cc1cc(N)nc(C)c1CNC(=O)c1c(nnn1Cc1ccc2ncc(Cl)cc2c1)C(F)(F)F
: