Target
cAMP-specific 3',5'-cyclic phosphodiesterase 4B
Ligand
BDBM463557
Substrate
Meas. Tech.
Inhibition In Vitro Assay
IC50
1.80±n/a nM
Citation
 Deng, GGHuang, DJesudason, CDOdingo, JO Azetidinyloxyphenylpyrrolidine compounds US Patent  US10781202 Publication Date 9/22/2020 
Target
Name:
cAMP-specific 3',5'-cyclic phosphodiesterase 4B
Synonyms:
3',5'-cyclic phosphodiesterase Isoform PDE4B1 PDE4B PDE4B_HUMAN Phosphodiesterase 4B (PDE4B) Phosphodiesterase Type 4 (PDE4B)
Type:
Protein
Mol. Mass.:
83318.87
Organism:
Homo sapiens (Human)
Description:
Q07343
Residue:
736
  
Inhibitor
Name:
BDBM463557
Synonyms:
(2S)-3-[(3S,4S)- 3-[(1R)-1- hydroxyethyl]-4- {4-methoxy-3- [(1-pyridin-3- ylazetidin-3- yl)oxy]phenyl}- 3- methylpyrrolidin- 1-yl]-3- oxopropane-1,2- diol | US10781202, Example 2
Type:
Small organic molecule
Emp. Form.:
C25H33N3O6
Mol. Mass.:
471.546
SMILES:
COc1ccc(cc1OC1CN(C1)c1cccnc1)[C@@H]1CN(C[C@@]1(C)[C@@H](C)O)C(=O)[C@@H](O)CO
: