Target
Non-receptor tyrosine-protein kinase TYK2
Ligand
BDBM463637
Substrate
Meas. Tech.
Caliper Assay
Ki
5±n/a nM
Citation
 Masse, CEGreenwood, JRRomero, DLHarriman, GCWester, RTShelley, MKennedy-Smith, JJDahlgren, MMondal, SRobinson, S TYK2 inhibitors and uses thereof US Patent  US10781204 Publication Date 9/22/2020 
Target
Name:
Non-receptor tyrosine-protein kinase TYK2
Synonyms:
Non-receptor tyrosine-protein kinase TYK2 (TYK2) TYK2_HUMAN | Tyrosine-protein kinase TYK2
Type:
Protein
Mol. Mass.:
133666.03
Organism:
Homo sapiens (Human)
Description:
P29597
Residue:
1187
  
Inhibitor
Name:
BDBM463637
Synonyms:
US10781204, Compound I-116 | US11434240, Compound I-116
Type:
Small organic molecule
Emp. Form.:
C22H16FN7O
Mol. Mass.:
413.4071
SMILES:
Fc1cccc(C#N)c1-c1cc(c2C(=O)NCc2n1)-n1ccc(n1)N1CCC(C1)C#N
: