Target
Tyrosine-protein kinase JAK2
Ligand
BDBM463758
Substrate
Meas. Tech.
Caliper Assay
Ki
5±n/a nM
Citation
 Masse, CEGreenwood, JRRomero, DLHarriman, GCWester, RTShelley, MKennedy-Smith, JJDahlgren, MMondal, SRobinson, S TYK2 inhibitors and uses thereof US Patent  US10781204 Publication Date 9/22/2020 
Target
Name:
Tyrosine-protein kinase JAK2
Synonyms:
JAK-2 JAK2_HUMAN Janus kinase 2 (JAK2) | Janus kinase 2 (a protein tyrosine kinase)
Type:
Protein
Mol. Mass.:
130684.68
Organism:
Homo sapiens (Human)
Description:
O60674
Residue:
1132
  
Inhibitor
Name:
BDBM463758
Synonyms:
US10781204, Compound I-235 | US11434240, Compound I-235
Type:
Small organic molecule
Emp. Form.:
C20H15FN6O2
Mol. Mass.:
390.3705
SMILES:
OC1CNc2cc(nn2C1)-c1cc(nc2CNC(=O)c12)-c1c(F)cccc1C#N
: