Target
Bromodomain-containing protein 4
Ligand
BDBM391503
Substrate
Meas. Tech.
AlphaScreen Assay
IC50
<100±n/a nM
Citation
 Combs, APMaduskuie, Jr., TPFalahatpisheh, N 1H-pyrrolo[2,3-c]pyridin-7(6H)-ones and pyrazolo[3,4-c]pyridin-7(6H)-ones as inhibitors of BET proteins US Patent  US10781209 Publication Date 9/22/2020 
Target
Name:
Bromodomain-containing protein 4
Synonyms:
BRD4 Bromodomain-containing protein 4 (BRD4) Protein HUNK1
Type:
Protein
Mol. Mass.:
152264.84
Organism:
Homo sapiens (Human)
Description:
O60885
Residue:
1362
  
Inhibitor
Name:
BDBM391503
Synonyms:
2-methyl-8-(6-methyl-7-oxo- US10781209, Example 3 US11702416, Example 3 | US9957268, Example 3
Type:
Small organic molecule
Emp. Form.:
C17H15N3O3
Mol. Mass.:
309.3193
SMILES:
CC1Oc2c(NC1=O)cccc2-c1cn(C)c(=O)c2[nH]ccc12
: