Target
Bromodomain-containing protein 4
Ligand
BDBM463783
Substrate
Meas. Tech.
AlphaScreen Assay
IC50
<100±n/a nM
Citation
 Combs, APMaduskuie, Jr., TPFalahatpisheh, N 1H-pyrrolo[2,3-c]pyridin-7(6H)-ones and pyrazolo[3,4-c]pyridin-7(6H)-ones as inhibitors of BET proteins US Patent  US10781209 Publication Date 9/22/2020 
Target
Name:
Bromodomain-containing protein 4
Synonyms:
BRD4 Bromodomain-containing protein 4 (BRD4) Protein HUNK1
Type:
Protein
Mol. Mass.:
152264.84
Organism:
Homo sapiens (Human)
Description:
O60885
Residue:
1362
  
Inhibitor
Name:
BDBM463783
Synonyms:
2-cyclopropyl-6-methoxy- 8-(6-methyl-7-oxo-6,7- dihydro-1H-pyrrolo[2,3- c]pyridin-4-yl)-2H-1,4- US11059821, Example 23
Type:
Small organic molecule
Emp. Form.:
C21H23N3O3
Mol. Mass.:
365.4256
SMILES:
COc1cc2N(C)CC(Oc2c(c1)-c1cn(C)c(=O)c2[nH]ccc12)C1CC1
: