Target
Bromodomain-containing protein 4
Ligand
BDBM463786
Substrate
Meas. Tech.
AlphaScreen Assay
IC50
<100±n/a nM
Citation
 Combs, APMaduskuie, Jr., TPFalahatpisheh, N 1H-pyrrolo[2,3-c]pyridin-7(6H)-ones and pyrazolo[3,4-c]pyridin-7(6H)-ones as inhibitors of BET proteins US Patent  US10781209 Publication Date 9/22/2020 
Target
Name:
Bromodomain-containing protein 4
Synonyms:
BRD4 Bromodomain-containing protein 4 (BRD4) Protein HUNK1
Type:
Protein
Mol. Mass.:
152264.84
Organism:
Homo sapiens (Human)
Description:
O60885
Residue:
1362
  
Inhibitor
Name:
BDBM463786
Synonyms:
US10781209, Example 24B
Type:
Small organic molecule
Emp. Form.:
C24H23N3O3
Mol. Mass.:
401.4577
SMILES:
COc1cc2N(C)C[C@H](Oc2c(c1)-c1cn(C)c(=O)c2[nH]ccc12)c1ccccc1
: