Target
Bromodomain-containing protein 4
Ligand
BDBM391573
Substrate
Meas. Tech.
AlphaScreen Assay
IC50
<100±n/a nM
Citation
 Combs, APMaduskuie, Jr., TPFalahatpisheh, N 1H-pyrrolo[2,3-c]pyridin-7(6H)-ones and pyrazolo[3,4-c]pyridin-7(6H)-ones as inhibitors of BET proteins US Patent  US10781209 Publication Date 9/22/2020 
Target
Name:
Bromodomain-containing protein 4
Synonyms:
BRD4 Bromodomain-containing protein 4 (BRD4) Protein HUNK1
Type:
Protein
Mol. Mass.:
152264.84
Organism:
Homo sapiens (Human)
Description:
O60885
Residue:
1362
  
Inhibitor
Name:
BDBM391573
Synonyms:
(3R)-3-isopropyl-5-(6-methyl-7- oxo-6,7-dihydro-1H-pyrrolo[2,3- c]pyridin-4-yl)-7- (methylsulfonyl)-3,4- dihydroquinoxalin-2(1H)-one US11059821, Example 44B US9957268, Example 61
Type:
Small organic molecule
Emp. Form.:
C20H21N3O5S
Mol. Mass.:
415.463
SMILES:
CC(C)[C@H]1Oc2c(NC1=O)cc(cc2-c1cn(C)c(=O)c2[nH]ccc12)S(C)(=O)=O
: