Target
Bromodomain-containing protein 4
Ligand
BDBM391556
Substrate
Meas. Tech.
AlphaScreen Assay
IC50
<100±n/a nM
Citation
 Combs, APMaduskuie, Jr., TPFalahatpisheh, N 1H-pyrrolo[2,3-c]pyridin-7(6H)-ones and pyrazolo[3,4-c]pyridin-7(6H)-ones as inhibitors of BET proteins US Patent  US10781209 Publication Date 9/22/2020 
Target
Name:
Bromodomain-containing protein 4
Synonyms:
BRD4 Bromodomain-containing protein 4 (BRD4) Protein HUNK1
Type:
Protein
Mol. Mass.:
152264.84
Organism:
Homo sapiens (Human)
Description:
O60885
Residue:
1362
  
Inhibitor
Name:
BDBM391556
Synonyms:
8-(6-methyl-7-oxo-6,7- dihydro-1H-pyrrolo[2,3- c]pyridin-4-yl)-6- (methylsulfonyl)-2-phenyl- 2H-1,4-benzoxazin-3(4H)- one US10781209, Example 46 US11702416, Example 46 | US9957268, Example 46
Type:
Small organic molecule
Emp. Form.:
C23H19N3O5S
Mol. Mass.:
449.479
SMILES:
Cn1cc(-c2cc(cc3NC(=O)C(Oc23)c2ccccc2)S(C)(=O)=O)c2cc[nH]c2c1=O
: