Target
Monoglyceride lipase
Ligand
BDBM280577
Substrate
Meas. Tech.
In Vitro Competitive Activity-Based Protein Profiling Assay
IC50
<100±n/a nM
Citation
 Buzard, DJShaghafi, MBCisar, JSGrice, CAJones, TKWeber, OD Spirocycle compounds and methods of making and using same US Patent  US10781211 Publication Date 9/22/2020 
Target
Name:
Monoglyceride lipase
Synonyms:
HU-K5 Lysophospholipase-like MGL MGLL_HUMAN
Type:
Hydrolase
Mol. Mass.:
33264.56
Organism:
Homo sapiens (Human)
Description:
Human recombinant MGL (Cayman Chemical, cat# 10008354).
Residue:
303
  
Inhibitor
Name:
BDBM280577
Synonyms:
US10030020, Example 122 | US10781211, Example 122
Type:
Small organic molecule
Emp. Form.:
C25H30ClF6N3O4
Mol. Mass.:
585.967
SMILES:
OC(=O)C1CCN(CC1)c1cc(Cl)cc(CN2CCCC22CCN(CC2)C(=O)OC(C(F)(F)F)C(F)(F)F)c1
: