Target
Cannabinoid receptor 1
Ligand
BDBM463845
Substrate
Meas. Tech.
Radioligand Displacement Assay
Ki
516±n/a nM
Citation
 Kunos, GIyer, MCinar, RRice, KC Cannabinoid receptor mediating iminopyrazole compounds US Patent  US10787419 Publication Date 9/29/2020 
Target
Name:
Cannabinoid receptor 1
Synonyms:
Brain-type cannabinoid receptor CB-R CNR1_MOUSE Cannabinoid receptor | Cnr1
Type:
Enzyme
Mol. Mass.:
52842.52
Organism:
Mus musculus (Mouse)
Description:
P47746
Residue:
473
  
Inhibitor
Name:
BDBM463845
Synonyms:
US10787419, Serial # 47
Type:
Small organic molecule
Emp. Form.:
C26H25Cl2N5O2S
Mol. Mass.:
542.48
SMILES:
CC(C)NC(=N)C(=N/S(=O)(=O)c1ccc(Cl)cc1)\N1CC(C(=N1)c1ccc(Cl)cc1)c1ccccc1
: