Target
Cannabinoid receptor 1
Ligand
BDBM463872
Substrate
Meas. Tech.
Radioligand Displacement Assay
Ki
2.70±n/a nM
Citation
 Kunos, GIyer, MCinar, RRice, KC Cannabinoid receptor mediating iminopyrazole compounds US Patent  US10787419 Publication Date 9/29/2020 
Target
Name:
Cannabinoid receptor 1
Synonyms:
Brain-type cannabinoid receptor CB-R CNR1_MOUSE Cannabinoid receptor | Cnr1
Type:
Enzyme
Mol. Mass.:
52842.52
Organism:
Mus musculus (Mouse)
Description:
P47746
Residue:
473
  
Inhibitor
Name:
BDBM463872
Synonyms:
US10787419, Serial # 72
Type:
Small organic molecule
Emp. Form.:
C26H21ClF3N5O3S
Mol. Mass.:
575.99
SMILES:
CC(=O)NC(=N)C(=N/S(=O)(=O)c1ccc(cc1)C(F)(F)F)\N1CC(C(=N1)c1ccc(Cl)cc1)c1ccccc1
: