Target
15-hydroxyprostaglandin dehydrogenase [NAD(+)]
Ligand
BDBM463946
Substrate
Meas. Tech.
Inhibitory Activity Assay
IC50
108±n/a nM
Citation
 Cho, HYoon, E Thiazolidinedione derivative and use thereof US Patent  US10787425 Publication Date 9/29/2020 
Target
Name:
15-hydroxyprostaglandin dehydrogenase [NAD(+)]
Synonyms:
15-PGDH HPGD PGDH_HUMAN SDR36C1
Type:
Enzyme
Mol. Mass.:
28974.46
Organism:
Homo sapiens (Human)
Description:
P15428
Residue:
266
  
Inhibitor
Name:
BDBM463946
Synonyms:
US10787425, Compound 72
Type:
Small organic molecule
Emp. Form.:
C18H13NO4S
Mol. Mass.:
339.365
SMILES:
O=C(Cc1ccccc1)Oc1ccc(\C=C2/SC(=O)NC2=O)cc1
: