Target
15-hydroxyprostaglandin dehydrogenase [NAD(+)]
Ligand
BDBM463965
Substrate
Meas. Tech.
Inhibitory Activity Assay
IC50
1083±n/a nM
Citation
 Cho, HYoon, E Thiazolidinedione derivative and use thereof US Patent  US10787425 Publication Date 9/29/2020 
Target
Name:
15-hydroxyprostaglandin dehydrogenase [NAD(+)]
Synonyms:
15-PGDH HPGD PGDH_HUMAN SDR36C1
Type:
Enzyme
Mol. Mass.:
28974.46
Organism:
Homo sapiens (Human)
Description:
P15428
Residue:
266
  
Inhibitor
Name:
BDBM463965
Synonyms:
US10787425, Compound 91
Type:
Small organic molecule
Emp. Form.:
C14H10ClNO4S
Mol. Mass.:
323.751
SMILES:
Clc1cc(OC(=O)C2CC2)ccc1\C=C1/SC(=O)NC1=O
: