Target
15-hydroxyprostaglandin dehydrogenase [NAD(+)]
Ligand
BDBM463975
Substrate
Meas. Tech.
Inhibitory Activity Assay
IC50
39.2±n/a nM
Citation
 Cho, HYoon, E Thiazolidinedione derivative and use thereof US Patent  US10787425 Publication Date 9/29/2020 
Target
Name:
15-hydroxyprostaglandin dehydrogenase [NAD(+)]
Synonyms:
15-PGDH HPGD PGDH_HUMAN SDR36C1
Type:
Enzyme
Mol. Mass.:
28974.46
Organism:
Homo sapiens (Human)
Description:
P15428
Residue:
266
  
Inhibitor
Name:
BDBM463975
Synonyms:
US10787425, Compound 99
Type:
Small organic molecule
Emp. Form.:
C20H22ClNO4S
Mol. Mass.:
407.911
SMILES:
Clc1cc(OC(=O)CCCC2CCCCC2)ccc1\C=C1/SC(=O)NC1=O
: